{"text_format":"1","workbook":"xlsx","n_sheets":3,"sheets":["PROGRAMACION","BACKEND","DATA"],"not_rendered":{"charts":0,"images":1,"macros":1,"external_links":0,"defined_names":10,"comments":0,"pivot_tables":0},"unopened":[],"bounds":{"document_bytes":16777216,"sheet_cells":100000,"rows_first":2000,"rows_last":500,"rows_between":2000,"halvings":0,"cell_chars":16384,"cell_head_chars":4096},"cells_cut":0,"cells_raw":0,"read":"whole","date_system":"1900"}

{"sheet":"PROGRAMACION","index":0,"n_rows":308,"n_cols":15,"rows_kept":308,"cut":false,"hidden":false,"merged":[[4,0,4,1],[5,0,5,1],[4,2,4,3],[5,2,5,3]]}
[null,"CENTRO NACIONAL DE DESPACHO"]
[null,"EMPRESA DE TRANSMISIÓN ELÉCTRICA, S.A."]
[null,"PROGRAMA DE MANTENIMIENTO ANUAL RTR"]
[]
["OS/OM",null,"PANAMA"]
["AGENTE"]
[]
["Semana","OS/OM Solicitante","Solmant No.","Fecha Inicio","Hora Inicio","Fecha Final","Hora Final","Continuo / Diario","Tipo Equipo","Equipo","Instalación","Con Desconexión","Sin Desconexión","Descripción del trabajo","Comentarios / Observaciones"]
[{"$f":" IF(NOT(D9=\"\"),VLOOKUP(D9,DATA!$J$3:$K$368,2,FALSE),\"\")","v":""},{"$f":"IF(NOT(D9=\"\"),\"PANAMA\",\"\")","v":""},null,{"$f":"IF(ISBLANK(BACKEND!D9),\"\",BACKEND!D9)","v":""},null,{"$f":"IF(ISBLANK(BACKEND!F9),\"\",BACKEND!F9)","v":""},null,null,null,null,{"$f":"IF(NOT(ISBLANK(J9)),VLOOKUP(J9,DATA!$V$1:$W$307,2,FALSE),\"\")","v":""},null,{"$f":"IF(ISBLANK(L9),\"\",IF(L9=\"SÍ\",\"NO\",\"SÍ\"))","v":""}]
[{"$f":" IF(NOT(D10=\"\"),VLOOKUP(D10,DATA!$J$3:$K$368,2,FALSE),\"\")","v":""},{"$f":"IF(NOT(D10=\"\"),\"PANAMA\",\"\")","v":""},null,{"$f":"IF(ISBLANK(BACKEND!D10),\"\",BACKEND!D10)","v":""},null,{"$f":"IF(ISBLANK(BACKEND!F10),\"\",BACKEND!F10)","v":""},null,null,null,null,{"$f":"IF(NOT(ISBLANK(J10)),VLOOKUP(J10,DATA!$V$1:$W$307,2,FALSE),\"\")","v":""},null,{"$f":"IF(ISBLANK(L10),\"\",IF(L10=\"SÍ\",\"NO\",\"SÍ\"))","v":""}]
[{"$f":" IF(NOT(D11=\"\"),VLOOKUP(D11,DATA!$J$3:$K$368,2,FALSE),\"\")","v":""},"",null,{"$f":"IF(ISBLANK(BACKEND!D11),\"\",BACKEND!D11)","v":""},null,{"$f":"IF(ISBLANK(BACKEND!F11),\"\",BACKEND!F11)","v":""},null,null,null,null,{"$f":"IF(NOT(ISBLANK(J11)),VLOOKUP(J11,DATA!$V$1:$W$307,2,FALSE),\"\")","v":""},null,""]
[{"$f":" IF(NOT(D12=\"\"),VLOOKUP(D12,DATA!$J$3:$K$368,2,FALSE),\"\")","v":""},"",null,{"$f":"IF(ISBLANK(BACKEND!D12),\"\",BACKEND!D12)","v":""},null,{"$f":"IF(ISBLANK(BACKEND!F12),\"\",BACKEND!F12)","v":""},null,null,null,null,{"$f":"IF(NOT(ISBLANK(J12)),VLOOKUP(J12,DATA!$V$1:$W$307,2,FALSE),\"\")","v":""},null,""]
[{"$f":" IF(NOT(D13=\"\"),VLOOKUP(D13,DATA!$J$3:$K$368,2,FALSE),\"\")","v":""},"",null,{"$f":"IF(ISBLANK(BACKEND!D13),\"\",BACKEND!D13)","v":""},null,{"$f":"IF(ISBLANK(BACKEND!F13),\"\",BACKEND!F13)","v":""},null,null,null,null,{"$f":"IF(NOT(ISBLANK(J13)),VLOOKUP(J13,DATA!$V$1:$W$307,2,FALSE),\"\")","v":""},null,""]
[{"$f":" IF(NOT(D14=\"\"),VLOOKUP(D14,DATA!$J$3:$K$368,2,FALSE),\"\")","v":""},"",null,{"$f":"IF(ISBLANK(BACKEND!D14),\"\",BACKEND!D14)","v":""},null,{"$f":"IF(ISBLANK(BACKEND!F14),\"\",BACKEND!F14)","v":""},null,null,null,null,{"$f":"IF(NOT(ISBLANK(J14)),VLOOKUP(J14,DATA!$V$1:$W$307,2,FALSE),\"\")","v":""},null,""]
[{"$f":" IF(NOT(D15=\"\"),VLOOKUP(D15,DATA!$J$3:$K$368,2,FALSE),\"\")","v":""},"",null,{"$f":"IF(ISBLANK(BACKEND!D15),\"\",BACKEND!D15)","v":""},null,{"$f":"IF(ISBLANK(BACKEND!F15),\"\",BACKEND!F15)","v":""},null,null,null,null,{"$f":"IF(NOT(ISBLANK(J15)),VLOOKUP(J15,DATA!$V$1:$W$307,2,FALSE),\"\")","v":""},null,""]
[{"$f":" IF(NOT(D16=\"\"),VLOOKUP(D16,DATA!$J$3:$K$368,2,FALSE),\"\")","v":""},"",null,{"$f":"IF(ISBLANK(BACKEND!D16),\"\",BACKEND!D16)","v":""},null,{"$f":"IF(ISBLANK(BACKEND!F16),\"\",BACKEND!F16)","v":""},null,null,null,null,{"$f":"IF(NOT(ISBLANK(J16)),VLOOKUP(J16,DATA!$V$1:$W$307,2,FALSE),\"\")","v":""},null,""]
[{"$f":" IF(NOT(D17=\"\"),VLOOKUP(D17,DATA!$J$3:$K$368,2,FALSE),\"\")","v":""},"",null,{"$f":"IF(ISBLANK(BACKEND!D17),\"\",BACKEND!D17)","v":""},null,{"$f":"IF(ISBLANK(BACKEND!F17),\"\",BACKEND!F17)","v":""},null,null,null,null,{"$f":"IF(NOT(ISBLANK(J17)),VLOOKUP(J17,DATA!$V$1:$W$307,2,FALSE),\"\")","v":""},null,""]
[{"$f":" IF(NOT(D18=\"\"),VLOOKUP(D18,DATA!$J$3:$K$368,2,FALSE),\"\")","v":""},"",null,{"$f":"IF(ISBLANK(BACKEND!D18),\"\",BACKEND!D18)","v":""},null,{"$f":"IF(ISBLANK(BACKEND!F18),\"\",BACKEND!F18)","v":""},null,null,null,null,{"$f":"IF(NOT(ISBLANK(J18)),VLOOKUP(J18,DATA!$V$1:$W$307,2,FALSE),\"\")","v":""},null,""]
[{"$f":" IF(NOT(D19=\"\"),VLOOKUP(D19,DATA!$J$3:$K$368,2,FALSE),\"\")","v":""},"",null,{"$f":"IF(ISBLANK(BACKEND!D19),\"\",BACKEND!D19)","v":""},null,{"$f":"IF(ISBLANK(BACKEND!F19),\"\",BACKEND!F19)","v":""},null,null,null,null,{"$f":"IF(NOT(ISBLANK(J19)),VLOOKUP(J19,DATA!$V$1:$W$307,2,FALSE),\"\")","v":""},null,""]
[{"$f":" IF(NOT(D20=\"\"),VLOOKUP(D20,DATA!$J$3:$K$368,2,FALSE),\"\")","v":""},"",null,{"$f":"IF(ISBLANK(BACKEND!D20),\"\",BACKEND!D20)","v":""},null,{"$f":"IF(ISBLANK(BACKEND!F20),\"\",BACKEND!F20)","v":""},null,null,null,null,{"$f":"IF(NOT(ISBLANK(J20)),VLOOKUP(J20,DATA!$V$1:$W$307,2,FALSE),\"\")","v":""},null,""]
{"$rows_left_out":289}
{"sheet":"BACKEND","index":1,"n_rows":308,"n_cols":15,"rows_kept":308,"cut":false,"hidden":true,"merged":[]}
[]
[]
[]
[]
[]
[]
[]
["Semana","OS/OM Solicitante","Solmant No.","Fecha Inicio","Hora Inicio","Fecha Final","Hora Final","Continuo / Diario","Tipo Equipo","Equipo","Instalación","Con Desconexión","Sin Desconexión","Descripción del trabajo","Comentarios / Observaciones"]
[{"$f":"IF(NOT(ISBLANK(PROGRAMACION!A9)),PROGRAMACION!A9,\"\")","v":""},{"$f":"IF(NOT(ISBLANK(PROGRAMACION!B9)),PROGRAMACION!B9,\"\")","v":""},{"$f":"IF(NOT(ISBLANK(PROGRAMACION!C9)),PROGRAMACION!C9,\"\")","v":""},null,{"$f":"IF(NOT(ISBLANK(PROGRAMACION!E9)),PROGRAMACION!E9,\"\")","v":""},null,{"$f":"IF(NOT(ISBLANK(PROGRAMACION!G9)),PROGRAMACION!G9,\"\")","v":""},{"$f":"IF(NOT(ISBLANK(PROGRAMACION!H9)),PROGRAMACION!H9,\"\")","v":""},{"$f":"IF(NOT(ISBLANK(PROGRAMACION!I9)),PROGRAMACION!I9,\"\")","v":""},{"$f":"IF(NOT(ISBLANK(PROGRAMACION!J9)),IF(PROGRAMACION!I9=\"Transformador\",MID(PROGRAMACION!J9,1,2),PROGRAMACION!J9),\"\")","v":""},{"$f":"IF(NOT(ISBLANK(PROGRAMACION!K9)),PROGRAMACION!K9,\"\")","v":""},{"$f":"IF(NOT(ISBLANK(PROGRAMACION!L9)),PROGRAMACION!L9,\"\")","v":""},{"$f":"IF(NOT(ISBLANK(PROGRAMACION!M9)),PROGRAMACION!M9,\"\")","v":""},{"$f":"IF(NOT(ISBLANK(PROGRAMACION!N9)),PROGRAMACION!N9,\"\")","v":""},{"$f":"IF(NOT(ISBLANK(PROGRAMACION!O9)),PROGRAMACION!O9,\"\")","v":""}]
[{"$f":"IF(NOT(ISBLANK(PROGRAMACION!A10)),PROGRAMACION!A10,\"\")","v":""},{"$f":"IF(NOT(ISBLANK(PROGRAMACION!B10)),PROGRAMACION!B10,\"\")","v":""},{"$f":"IF(NOT(ISBLANK(PROGRAMACION!C10)),PROGRAMACION!C10,\"\")","v":""},null,{"$f":"IF(NOT(ISBLANK(PROGRAMACION!E10)),PROGRAMACION!E10,\"\")","v":""},null,{"$f":"IF(NOT(ISBLANK(PROGRAMACION!G10)),PROGRAMACION!G10,\"\")","v":""},{"$f":"IF(NOT(ISBLANK(PROGRAMACION!H10)),PROGRAMACION!H10,\"\")","v":""},{"$f":"IF(NOT(ISBLANK(PROGRAMACION!I10)),PROGRAMACION!I10,\"\")","v":""},{"$f":"IF(NOT(ISBLANK(PROGRAMACION!J10)),IF(PROGRAMACION!I10=\"Transformador\",MID(PROGRAMACION!J10,1,2),PROGRAMACION!J10),\"\")","v":""},{"$f":"IF(NOT(ISBLANK(PROGRAMACION!K10)),PROGRAMACION!K10,\"\")","v":""},{"$f":"IF(NOT(ISBLANK(PROGRAMACION!L10)),PROGRAMACION!L10,\"\")","v":""},{"$f":"IF(NOT(ISBLANK(PROGRAMACION!M10)),PROGRAMACION!M10,\"\")","v":""},{"$f":"IF(NOT(ISBLANK(PROGRAMACION!N10)),PROGRAMACION!N10,\"\")","v":""},{"$f":"IF(NOT(ISBLANK(PROGRAMACION!O10)),PROGRAMACION!O10,\"\")","v":""}]
[{"$f":"IF(NOT(ISBLANK(PROGRAMACION!A11)),PROGRAMACION!A11,\"\")","v":""},{"$f":"IF(NOT(ISBLANK(PROGRAMACION!B11)),PROGRAMACION!B11,\"\")","v":""},{"$f":"IF(NOT(ISBLANK(PROGRAMACION!C11)),PROGRAMACION!C11,\"\")","v":""},null,{"$f":"IF(NOT(ISBLANK(PROGRAMACION!E11)),PROGRAMACION!E11,\"\")","v":""},null,{"$f":"IF(NOT(ISBLANK(PROGRAMACION!G11)),PROGRAMACION!G11,\"\")","v":""},{"$f":"IF(NOT(ISBLANK(PROGRAMACION!H11)),PROGRAMACION!H11,\"\")","v":""},{"$f":"IF(NOT(ISBLANK(PROGRAMACION!I11)),PROGRAMACION!I11,\"\")","v":""},{"$f":"IF(NOT(ISBLANK(PROGRAMACION!J11)),IF(PROGRAMACION!I11=\"Transformador\",MID(PROGRAMACION!J11,1,2),PROGRAMACION!J11),\"\")","v":""},{"$f":"IF(NOT(ISBLANK(PROGRAMACION!K11)),PROGRAMACION!K11,\"\")","v":""},{"$f":"IF(NOT(ISBLANK(PROGRAMACION!L11)),PROGRAMACION!L11,\"\")","v":""},{"$f":"IF(NOT(ISBLANK(PROGRAMACION!M11)),PROGRAMACION!M11,\"\")","v":""},{"$f":"IF(NOT(ISBLANK(PROGRAMACION!N11)),PROGRAMACION!N11,\"\")","v":""},{"$f":"IF(NOT(ISBLANK(PROGRAMACION!O11)),PROGRAMACION!O11,\"\")","v":""}]
[{"$f":"IF(NOT(ISBLANK(PROGRAMACION!A12)),PROGRAMACION!A12,\"\")","v":""},{"$f":"IF(NOT(ISBLANK(PROGRAMACION!B12)),PROGRAMACION!B12,\"\")","v":""},{"$f":"IF(NOT(ISBLANK(PROGRAMACION!C12)),PROGRAMACION!C12,\"\")","v":""},null,{"$f":"IF(NOT(ISBLANK(PROGRAMACION!E12)),PROGRAMACION!E12,\"\")","v":""},null,{"$f":"IF(NOT(ISBLANK(PROGRAMACION!G12)),PROGRAMACION!G12,\"\")","v":""},{"$f":"IF(NOT(ISBLANK(PROGRAMACION!H12)),PROGRAMACION!H12,\"\")","v":""},{"$f":"IF(NOT(ISBLANK(PROGRAMACION!I12)),PROGRAMACION!I12,\"\")","v":""},{"$f":"IF(NOT(ISBLANK(PROGRAMACION!J12)),IF(PROGRAMACION!I12=\"Transformador\",MID(PROGRAMACION!J12,1,2),PROGRAMACION!J12),\"\")","v":""},{"$f":"IF(NOT(ISBLANK(PROGRAMACION!K12)),PROGRAMACION!K12,\"\")","v":""},{"$f":"IF(NOT(ISBLANK(PROGRAMACION!L12)),PROGRAMACION!L12,\"\")","v":""},{"$f":"IF(NOT(ISBLANK(PROGRAMACION!M12)),PROGRAMACION!M12,\"\")","v":""},{"$f":"IF(NOT(ISBLANK(PROGRAMACION!N12)),PROGRAMACION!N12,\"\")","v":""},{"$f":"IF(NOT(ISBLANK(PROGRAMACION!O12)),PROGRAMACION!O12,\"\")","v":""}]
[{"$f":"IF(NOT(ISBLANK(PROGRAMACION!A13)),PROGRAMACION!A13,\"\")","v":""},{"$f":"IF(NOT(ISBLANK(PROGRAMACION!B13)),PROGRAMACION!B13,\"\")","v":""},{"$f":"IF(NOT(ISBLANK(PROGRAMACION!C13)),PROGRAMACION!C13,\"\")","v":""},null,{"$f":"IF(NOT(ISBLANK(PROGRAMACION!E13)),PROGRAMACION!E13,\"\")","v":""},null,{"$f":"IF(NOT(ISBLANK(PROGRAMACION!G13)),PROGRAMACION!G13,\"\")","v":""},{"$f":"IF(NOT(ISBLANK(PROGRAMACION!H13)),PROGRAMACION!H13,\"\")","v":""},{"$f":"IF(NOT(ISBLANK(PROGRAMACION!I13)),PROGRAMACION!I13,\"\")","v":""},{"$f":"IF(NOT(ISBLANK(PROGRAMACION!J13)),IF(PROGRAMACION!I13=\"Transformador\",MID(PROGRAMACION!J13,1,2),PROGRAMACION!J13),\"\")","v":""},{"$f":"IF(NOT(ISBLANK(PROGRAMACION!K13)),PROGRAMACION!K13,\"\")","v":""},{"$f":"IF(NOT(ISBLANK(PROGRAMACION!L13)),PROGRAMACION!L13,\"\")","v":""},{"$f":"IF(NOT(ISBLANK(PROGRAMACION!M13)),PROGRAMACION!M13,\"\")","v":""},{"$f":"IF(NOT(ISBLANK(PROGRAMACION!N13)),PROGRAMACION!N13,\"\")","v":""},{"$f":"IF(NOT(ISBLANK(PROGRAMACION!O13)),PROGRAMACION!O13,\"\")","v":""}]
[{"$f":"IF(NOT(ISBLANK(PROGRAMACION!A14)),PROGRAMACION!A14,\"\")","v":""},{"$f":"IF(NOT(ISBLANK(PROGRAMACION!B14)),PROGRAMACION!B14,\"\")","v":""},{"$f":"IF(NOT(ISBLANK(PROGRAMACION!C14)),PROGRAMACION!C14,\"\")","v":""},null,{"$f":"IF(NOT(ISBLANK(PROGRAMACION!E14)),PROGRAMACION!E14,\"\")","v":""},null,{"$f":"IF(NOT(ISBLANK(PROGRAMACION!G14)),PROGRAMACION!G14,\"\")","v":""},{"$f":"IF(NOT(ISBLANK(PROGRAMACION!H14)),PROGRAMACION!H14,\"\")","v":""},{"$f":"IF(NOT(ISBLANK(PROGRAMACION!I14)),PROGRAMACION!I14,\"\")","v":""},{"$f":"IF(NOT(ISBLANK(PROGRAMACION!J14)),IF(PROGRAMACION!I14=\"Transformador\",MID(PROGRAMACION!J14,1,2),PROGRAMACION!J14),\"\")","v":""},{"$f":"IF(NOT(ISBLANK(PROGRAMACION!K14)),PROGRAMACION!K14,\"\")","v":""},{"$f":"IF(NOT(ISBLANK(PROGRAMACION!L14)),PROGRAMACION!L14,\"\")","v":""},{"$f":"IF(NOT(ISBLANK(PROGRAMACION!M14)),PROGRAMACION!M14,\"\")","v":""},{"$f":"IF(NOT(ISBLANK(PROGRAMACION!N14)),PROGRAMACION!N14,\"\")","v":""},{"$f":"IF(NOT(ISBLANK(PROGRAMACION!O14)),PROGRAMACION!O14,\"\")","v":""}]
[{"$f":"IF(NOT(ISBLANK(PROGRAMACION!A15)),PROGRAMACION!A15,\"\")","v":""},{"$f":"IF(NOT(ISBLANK(PROGRAMACION!B15)),PROGRAMACION!B15,\"\")","v":""},{"$f":"IF(NOT(ISBLANK(PROGRAMACION!C15)),PROGRAMACION!C15,\"\")","v":""},null,{"$f":"IF(NOT(ISBLANK(PROGRAMACION!E15)),PROGRAMACION!E15,\"\")","v":""},null,{"$f":"IF(NOT(ISBLANK(PROGRAMACION!G15)),PROGRAMACION!G15,\"\")","v":""},{"$f":"IF(NOT(ISBLANK(PROGRAMACION!H15)),PROGRAMACION!H15,\"\")","v":""},{"$f":"IF(NOT(ISBLANK(PROGRAMACION!I15)),PROGRAMACION!I15,\"\")","v":""},{"$f":"IF(NOT(ISBLANK(PROGRAMACION!J15)),IF(PROGRAMACION!I15=\"Transformador\",MID(PROGRAMACION!J15,1,2),PROGRAMACION!J15),\"\")","v":""},{"$f":"IF(NOT(ISBLANK(PROGRAMACION!K15)),PROGRAMACION!K15,\"\")","v":""},{"$f":"IF(NOT(ISBLANK(PROGRAMACION!L15)),PROGRAMACION!L15,\"\")","v":""},{"$f":"IF(NOT(ISBLANK(PROGRAMACION!M15)),PROGRAMACION!M15,\"\")","v":""},{"$f":"IF(NOT(ISBLANK(PROGRAMACION!N15)),PROGRAMACION!N15,\"\")","v":""},{"$f":"IF(NOT(ISBLANK(PROGRAMACION!O15)),PROGRAMACION!O15,\"\")","v":""}]
[{"$f":"IF(NOT(ISBLANK(PROGRAMACION!A16)),PROGRAMACION!A16,\"\")","v":""},{"$f":"IF(NOT(ISBLANK(PROGRAMACION!B16)),PROGRAMACION!B16,\"\")","v":""},{"$f":"IF(NOT(ISBLANK(PROGRAMACION!C16)),PROGRAMACION!C16,\"\")","v":""},null,{"$f":"IF(NOT(ISBLANK(PROGRAMACION!E16)),PROGRAMACION!E16,\"\")","v":""},null,{"$f":"IF(NOT(ISBLANK(PROGRAMACION!G16)),PROGRAMACION!G16,\"\")","v":""},{"$f":"IF(NOT(ISBLANK(PROGRAMACION!H16)),PROGRAMACION!H16,\"\")","v":""},{"$f":"IF(NOT(ISBLANK(PROGRAMACION!I16)),PROGRAMACION!I16,\"\")","v":""},{"$f":"IF(NOT(ISBLANK(PROGRAMACION!J16)),IF(PROGRAMACION!I16=\"Transformador\",MID(PROGRAMACION!J16,1,2),PROGRAMACION!J16),\"\")","v":""},{"$f":"IF(NOT(ISBLANK(PROGRAMACION!K16)),PROGRAMACION!K16,\"\")","v":""},{"$f":"IF(NOT(ISBLANK(PROGRAMACION!L16)),PROGRAMACION!L16,\"\")","v":""},{"$f":"IF(NOT(ISBLANK(PROGRAMACION!M16)),PROGRAMACION!M16,\"\")","v":""},{"$f":"IF(NOT(ISBLANK(PROGRAMACION!N16)),PROGRAMACION!N16,\"\")","v":""},{"$f":"IF(NOT(ISBLANK(PROGRAMACION!O16)),PROGRAMACION!O16,\"\")","v":""}]
[{"$f":"IF(NOT(ISBLANK(PROGRAMACION!A17)),PROGRAMACION!A17,\"\")","v":""},{"$f":"IF(NOT(ISBLANK(PROGRAMACION!B17)),PROGRAMACION!B17,\"\")","v":""},{"$f":"IF(NOT(ISBLANK(PROGRAMACION!C17)),PROGRAMACION!C17,\"\")","v":""},null,{"$f":"IF(NOT(ISBLANK(PROGRAMACION!E17)),PROGRAMACION!E17,\"\")","v":""},null,{"$f":"IF(NOT(ISBLANK(PROGRAMACION!G17)),PROGRAMACION!G17,\"\")","v":""},{"$f":"IF(NOT(ISBLANK(PROGRAMACION!H17)),PROGRAMACION!H17,\"\")","v":""},{"$f":"IF(NOT(ISBLANK(PROGRAMACION!I17)),PROGRAMACION!I17,\"\")","v":""},{"$f":"IF(NOT(ISBLANK(PROGRAMACION!J17)),IF(PROGRAMACION!I17=\"Transformador\",MID(PROGRAMACION!J17,1,2),PROGRAMACION!J17),\"\")","v":""},{"$f":"IF(NOT(ISBLANK(PROGRAMACION!K17)),PROGRAMACION!K17,\"\")","v":""},{"$f":"IF(NOT(ISBLANK(PROGRAMACION!L17)),PROGRAMACION!L17,\"\")","v":""},{"$f":"IF(NOT(ISBLANK(PROGRAMACION!M17)),PROGRAMACION!M17,\"\")","v":""},{"$f":"IF(NOT(ISBLANK(PROGRAMACION!N17)),PROGRAMACION!N17,\"\")","v":""},{"$f":"IF(NOT(ISBLANK(PROGRAMACION!O17)),PROGRAMACION!O17,\"\")","v":""}]
[{"$f":"IF(NOT(ISBLANK(PROGRAMACION!A18)),PROGRAMACION!A18,\"\")","v":""},{"$f":"IF(NOT(ISBLANK(PROGRAMACION!B18)),PROGRAMACION!B18,\"\")","v":""},{"$f":"IF(NOT(ISBLANK(PROGRAMACION!C18)),PROGRAMACION!C18,\"\")","v":""},null,{"$f":"IF(NOT(ISBLANK(PROGRAMACION!E18)),PROGRAMACION!E18,\"\")","v":""},null,{"$f":"IF(NOT(ISBLANK(PROGRAMACION!G18)),PROGRAMACION!G18,\"\")","v":""},{"$f":"IF(NOT(ISBLANK(PROGRAMACION!H18)),PROGRAMACION!H18,\"\")","v":""},{"$f":"IF(NOT(ISBLANK(PROGRAMACION!I18)),PROGRAMACION!I18,\"\")","v":""},{"$f":"IF(NOT(ISBLANK(PROGRAMACION!J18)),IF(PROGRAMACION!I18=\"Transformador\",MID(PROGRAMACION!J18,1,2),PROGRAMACION!J18),\"\")","v":""},{"$f":"IF(NOT(ISBLANK(PROGRAMACION!K18)),PROGRAMACION!K18,\"\")","v":""},{"$f":"IF(NOT(ISBLANK(PROGRAMACION!L18)),PROGRAMACION!L18,\"\")","v":""},{"$f":"IF(NOT(ISBLANK(PROGRAMACION!M18)),PROGRAMACION!M18,\"\")","v":""},{"$f":"IF(NOT(ISBLANK(PROGRAMACION!N18)),PROGRAMACION!N18,\"\")","v":""},{"$f":"IF(NOT(ISBLANK(PROGRAMACION!O18)),PROGRAMACION!O18,\"\")","v":""}]
[{"$f":"IF(NOT(ISBLANK(PROGRAMACION!A19)),PROGRAMACION!A19,\"\")","v":""},{"$f":"IF(NOT(ISBLANK(PROGRAMACION!B19)),PROGRAMACION!B19,\"\")","v":""},{"$f":"IF(NOT(ISBLANK(PROGRAMACION!C19)),PROGRAMACION!C19,\"\")","v":""},null,{"$f":"IF(NOT(ISBLANK(PROGRAMACION!E19)),PROGRAMACION!E19,\"\")","v":""},null,{"$f":"IF(NOT(ISBLANK(PROGRAMACION!G19)),PROGRAMACION!G19,\"\")","v":""},{"$f":"IF(NOT(ISBLANK(PROGRAMACION!H19)),PROGRAMACION!H19,\"\")","v":""},{"$f":"IF(NOT(ISBLANK(PROGRAMACION!I19)),PROGRAMACION!I19,\"\")","v":""},{"$f":"IF(NOT(ISBLANK(PROGRAMACION!J19)),IF(PROGRAMACION!I19=\"Transformador\",MID(PROGRAMACION!J19,1,2),PROGRAMACION!J19),\"\")","v":""},{"$f":"IF(NOT(ISBLANK(PROGRAMACION!K19)),PROGRAMACION!K19,\"\")","v":""},{"$f":"IF(NOT(ISBLANK(PROGRAMACION!L19)),PROGRAMACION!L19,\"\")","v":""},{"$f":"IF(NOT(ISBLANK(PROGRAMACION!M19)),PROGRAMACION!M19,\"\")","v":""},{"$f":"IF(NOT(ISBLANK(PROGRAMACION!N19)),PROGRAMACION!N19,\"\")","v":""},{"$f":"IF(NOT(ISBLANK(PROGRAMACION!O19)),PROGRAMACION!O19,\"\")","v":""}]
[{"$f":"IF(NOT(ISBLANK(PROGRAMACION!A20)),PROGRAMACION!A20,\"\")","v":""},{"$f":"IF(NOT(ISBLANK(PROGRAMACION!B20)),PROGRAMACION!B20,\"\")","v":""},{"$f":"IF(NOT(ISBLANK(PROGRAMACION!C20)),PROGRAMACION!C20,\"\")","v":""},null,{"$f":"IF(NOT(ISBLANK(PROGRAMACION!E20)),PROGRAMACION!E20,\"\")","v":""},null,{"$f":"IF(NOT(ISBLANK(PROGRAMACION!G20)),PROGRAMACION!G20,\"\")","v":""},{"$f":"IF(NOT(ISBLANK(PROGRAMACION!H20)),PROGRAMACION!H20,\"\")","v":""},{"$f":"IF(NOT(ISBLANK(PROGRAMACION!I20)),PROGRAMACION!I20,\"\")","v":""},{"$f":"IF(NOT(ISBLANK(PROGRAMACION!J20)),IF(PROGRAMACION!I20=\"Transformador\",MID(PROGRAMACION!J20,1,2),PROGRAMACION!J20),\"\")","v":""},{"$f":"IF(NOT(ISBLANK(PROGRAMACION!K20)),PROGRAMACION!K20,\"\")","v":""},{"$f":"IF(NOT(ISBLANK(PROGRAMACION!L20)),PROGRAMACION!L20,\"\")","v":""},{"$f":"IF(NOT(ISBLANK(PROGRAMACION!M20)),PROGRAMACION!M20,\"\")","v":""},{"$f":"IF(NOT(ISBLANK(PROGRAMACION!N20)),PROGRAMACION!N20,\"\")","v":""},{"$f":"IF(NOT(ISBLANK(PROGRAMACION!O20)),PROGRAMACION!O20,\"\")","v":""}]
{"$rows_left_out":289}
{"sheet":"DATA","index":2,"n_rows":368,"n_cols":23,"rows_kept":368,"cut":false,"hidden":true,"merged":[[7,12,7,17]]}
["00:00:00","CONTÍNUO","SÍ","Barra (115)","Barra (115)","Barra115","A de Bajo de Mina","Bajo de Mina","ACP","2024-12-31",52,null,null,null,null,null,null,null,null,null,"ACP","A de Panamá","Panamá"]
["01:00:00","DIARIO","NO","Barra (230)","Barra (230)","Barra230","A de Cáceres","Cáceres","AES CHANGUINOLA, S.R.L.","2027-01-01",52,null,null,null,null,null,null,null,null,null,"AES CHANGUINOLA, S.R.L.","B de Panamá","Panamá"]
["02:00:00",null,null,"Línea (115)","Línea (115)","Linea115","B de Cáceres","Cáceres","AES PANAMA, S.R.L.",{"$f":"J2+1","v":"2027-01-02"},52,null,null,null,null,null,null,null,null,null,"AES PANAMA, S.R.L.","A de Cáceres","Cáceres"]
["03:00:00",null,null,"Línea (230)","Línea (230)","Linea230","A de Cativá","Cativá","ALTERNEGY",{"$f":"J3+1","v":"2027-01-03"},52,null,null,null,null,null,null,null,null,null,"ALTERNEGY","B de Cáceres","Cáceres"]
["04:00:00",null,null,"Transformador","Transformador","Transformador","A de Cativá 2","Cativá 2","ANDREAS POWER ENERGY CORP.",{"$f":"J4+1","v":"2027-01-04"},1,null,null,null,null,null,null,null,null,null,"ARGOS PANAMÁ S.A.","A de Cativá","Cativá"]
["05:00:00",null,null,null,null,null,"A de CPSA","CPSA","ARGENTUM SOLAR, S.A.",{"$f":"J5+1","v":"2027-01-05"},1,null,null,null,null,null,null,null,null,null,"CELSIA CENTROAMÉRICA, S.A.","A de Cativá 2","Cativá 2"]
["06:00:00",null,null,null,null,null,"B de CPSA","CPSA","ARGOS PANAMÁ S.A.","2027-01-06",1,null,null,null,null,null,null,null,null,null,"ELECTRON INVESTMENT S.A.","A de Las Minas 1","Las Minas 1"]
["07:00:00",null,null,null,null,null,"A de Las Minas 1","Las Minas 1","AVANZALIA PANAMÁ, S.A.","2027-01-07",1,null,"No modificar estas celdas (P,Q,R)",null,null,null,null,null,null,null,"ENEL FORTUNA","B de Las Minas 1","Las Minas 1"]
["08:00:00",null,null,null,null,null,"B de Las Minas 1","Las Minas 1","AZUCARERA NACIONAL, S.A.","2027-01-08",1,null,{"$f":"IF(ISBLANK(BACKEND!D9),\"\",BACKEND!D9)","v":""},{"$f":"IF(ISBLANK(BACKEND!E9),\"\",BACKEND!E9)","v":""},{"$f":"IF(ISBLANK(BACKEND!F9),\"\",BACKEND!F9)","v":""},{"$f":"IF(ISBLANK(BACKEND!G9),\"\",BACKEND!G9)","v":""},{"$f":"IF(AND(M9=\"\",N9=\"\",O9=\"\",P9=\"\"),FALSE,IFERROR((M9+N9)>=(O9+P9),TRUE))","v":false},{"$f":"Q9","v":false},null,null,"ENSA","A de Miraflores","Miraflores"]
["09:00:00",null,null,null,null,null,"A de Miraflores","Miraflores","BLM CORP.","2027-01-09",1,null,{"$f":"IF(ISBLANK(BACKEND!D10),\"\",BACKEND!D10)","v":""},{"$f":"IF(ISBLANK(BACKEND!E10),\"\",BACKEND!E10)","v":""},{"$f":"IF(ISBLANK(BACKEND!F10),\"\",BACKEND!F10)","v":""},{"$f":"IF(ISBLANK(BACKEND!G10),\"\",BACKEND!G10)","v":""},{"$f":"IF(AND(M10=\"\",N10=\"\",O10=\"\",P10=\"\"),FALSE,IFERROR((M10+N10)>=(O10+P10),TRUE))","v":false},{"$f":"Q10","v":false},null,null,"EPR","B de Miraflores","Miraflores"]
["10:00:00",null,null,null,null,null,"B de Miraflores","Miraflores","BONTEX","2027-01-10",2,null,{"$f":"IF(ISBLANK(BACKEND!D11),\"\",BACKEND!D11)","v":""},{"$f":"IF(ISBLANK(BACKEND!E11),\"\",BACKEND!E11)","v":""},{"$f":"IF(ISBLANK(BACKEND!F11),\"\",BACKEND!F11)","v":""},{"$f":"IF(ISBLANK(BACKEND!G11),\"\",BACKEND!G11)","v":""},false,false,null,null,"ETESA","A de Santa Rita","Santa Rita"]
["11:00:00",null,null,null,null,null,"A de Panamá","Panamá","CAFE DE ELETA","2027-01-11",2,null,{"$f":"IF(ISBLANK(BACKEND!D12),\"\",BACKEND!D12)","v":""},{"$f":"IF(ISBLANK(BACKEND!E12),\"\",BACKEND!E12)","v":""},{"$f":"IF(ISBLANK(BACKEND!F12),\"\",BACKEND!F12)","v":""},{"$f":"IF(ISBLANK(BACKEND!G12),\"\",BACKEND!G12)","v":""},false,false,null,null,"FOUNTAIN HYDRO POWER CORP.","B de Santa Rita","Santa Rita"]
["12:00:00",null,null,null,null,null,"B de Panamá","Panamá","CALDERA ENERGY CORP.","2027-01-12",2,null,{"$f":"IF(ISBLANK(BACKEND!D13),\"\",BACKEND!D13)","v":""},{"$f":"IF(ISBLANK(BACKEND!E13),\"\",BACKEND!E13)","v":""},{"$f":"IF(ISBLANK(BACKEND!F13),\"\",BACKEND!F13)","v":""},{"$f":"IF(ISBLANK(BACKEND!G13),\"\",BACKEND!G13)","v":""},false,false,null,null,"GAS NATURAL ATLÁNTICO, S. DE R. L.","A de Changuinola","Changuinola"]
["13:00:00",null,null,null,null,null,"A de Santa María","Santa María","CELSIA CENTROAMÉRICA, S.A.","2027-01-13",2,null,{"$f":"IF(ISBLANK(BACKEND!D14),\"\",BACKEND!D14)","v":""},{"$f":"IF(ISBLANK(BACKEND!E14),\"\",BACKEND!E14)","v":""},{"$f":"IF(ISBLANK(BACKEND!F14),\"\",BACKEND!F14)","v":""},{"$f":"IF(ISBLANK(BACKEND!G14),\"\",BACKEND!G14)","v":""},false,false,null,null,"GENA","B de Changuinola","Changuinola"]
["14:00:00",null,null,null,null,null,"A de Santa Rita","Santa Rita","CELSOLAR, S.A.","2027-01-14",2,null,{"$f":"IF(ISBLANK(BACKEND!D15),\"\",BACKEND!D15)","v":""},{"$f":"IF(ISBLANK(BACKEND!E15),\"\",BACKEND!E15)","v":""},{"$f":"IF(ISBLANK(BACKEND!F15),\"\",BACKEND!F15)","v":""},{"$f":"IF(ISBLANK(BACKEND!G15),\"\",BACKEND!G15)","v":""},false,false,null,null,"GENERADORA DEL ISTMO","A de Dominical","Dominical"]
["15:00:00",null,null,null,null,null,"B de Santa Rita","Santa Rita","CENTRAL AZUCARERO DE ALANJE, S.A.","2027-01-15",2,null,{"$f":"IF(ISBLANK(BACKEND!D16),\"\",BACKEND!D16)","v":""},{"$f":"IF(ISBLANK(BACKEND!E16),\"\",BACKEND!E16)","v":""},{"$f":"IF(ISBLANK(BACKEND!F16),\"\",BACKEND!F16)","v":""},{"$f":"IF(ISBLANK(BACKEND!G16),\"\",BACKEND!G16)","v":""},false,false,null,null,"GENERADORA DE GATÚN, S.A.","B de Dominical","Dominical"]
["16:00:00",null,null,null,null,null,"A de Caldera","Caldera","CND","2027-01-16",2,null,{"$f":"IF(ISBLANK(BACKEND!D17),\"\",BACKEND!D17)","v":""},{"$f":"IF(ISBLANK(BACKEND!E17),\"\",BACKEND!E17)","v":""},{"$f":"IF(ISBLANK(BACKEND!F17),\"\",BACKEND!F17)","v":""},{"$f":"IF(ISBLANK(BACKEND!G17),\"\",BACKEND!G17)","v":""},false,false,null,null,"IDEAL PANAMÁ, S.A.","A de Panamá","Panamá"]
["17:00:00",null,null,null,null,null,"B de Caldera","Caldera","CNDMET","2027-01-17",2,null,{"$f":"IF(ISBLANK(BACKEND!D18),\"\",BACKEND!D18)","v":""},{"$f":"IF(ISBLANK(BACKEND!E18),\"\",BACKEND!E18)","v":""},{"$f":"IF(ISBLANK(BACKEND!F18),\"\",BACKEND!F18)","v":""},{"$f":"IF(ISBLANK(BACKEND!G18),\"\",BACKEND!G18)","v":""},false,false,null,null,"PANAM","B de Panamá","Panamá"]
["18:00:00",null,null,null,null,null,"A de Centro Bancario","Centro Bancario","CNDSCADA","2027-01-18",3,null,{"$f":"IF(ISBLANK(BACKEND!D19),\"\",BACKEND!D19)","v":""},{"$f":"IF(ISBLANK(BACKEND!E19),\"\",BACKEND!E19)","v":""},{"$f":"IF(ISBLANK(BACKEND!F19),\"\",BACKEND!F19)","v":""},{"$f":"IF(ISBLANK(BACKEND!G19),\"\",BACKEND!G19)","v":""},false,false,null,null,"PARQUE EÓLICO TOABRÉ, S.A.","A de Panamá II","Panamá II"]
["19:00:00",null,null,null,null,null,"2B de Cerro Viento","Cerro Viento","CONCEPTO SOLAR, S.A.","2027-01-19",3,null,{"$f":"IF(ISBLANK(BACKEND!D20),\"\",BACKEND!D20)","v":""},{"$f":"IF(ISBLANK(BACKEND!E20),\"\",BACKEND!E20)","v":""},{"$f":"IF(ISBLANK(BACKEND!F20),\"\",BACKEND!F20)","v":""},{"$f":"IF(ISBLANK(BACKEND!G20),\"\",BACKEND!G20)","v":""},false,false,null,null,"PEDREGAL POWER","B de Panamá II","Panamá II"]
{"$rows_left_out":348}